{"text_format":"1","workbook":"xlsx","n_sheets":10,"sheets":["Front Sheet","Current & Potential","LookupsC&P","Support Form","Goal Planning","lookups","Options","Data Sheet (2)","Data Sheet","Charts"],"not_rendered":{"charts":9,"images":2,"macros":1,"external_links":0,"defined_names":2,"comments":0,"pivot_tables":0},"unopened":[],"bounds":{"document_bytes":16777216,"sheet_cells":100000,"rows_first":2000,"rows_last":500,"rows_between":2000,"halvings":0,"cell_chars":16384,"cell_head_chars":4096},"cells_cut":0,"cells_raw":0,"read":"whole","date_system":"1900"}

{"sheet":"Front Sheet","index":0,"n_rows":91,"n_cols":3,"rows_kept":91,"cut":false,"hidden":false,"merged":[[19,1,19,2],[90,0,91,3],[89,1,89,2],[2,1,2,3]]}
[]
[null,"                            Please do not add/amend or delete any content of this document."]
[null,"                            Please call Practitioner to discuss any changes."]
[null,"Initials:"]
[]
[null,"Eclipse no:"]
{"$rows_left_out":86}
{"sheet":"Current & Potential","index":1,"n_rows":159,"n_cols":20,"rows_kept":159,"cut":false,"hidden":false,"merged":[[81,13,99,13],[100,13,118,13],[119,13,137,13],[138,13,156,13],[157,13,164,13],[3,0,3,8],[5,13,23,13],[24,13,42,13],[43,13,61,13],[62,13,80,13]]}
["A1-1","B1-1","C1-1","D1-1","E1-1","F1-1","G1-1","H1-1","I1-1","J1-1","K1-1","L1-1","M1-1","N1-1","O1-1","P1-1","Q1-1","R1-1","S1-1","T1-1"]
["A2-1","B2-1","C2-1","D2-1","E2-1","F2-1","G2-1","H2-1","I2-1","J2-1","K2-1","L2-1","M2-1","N2-1","O2-1","P2-1","Q2-1","R2-1","S2-1","T2-1"]
[{"$f":"A1=A2","v":false},{"$f":"B1=B2","v":false},false,false,false,false,false,false,false,false,false,false,false,false,false,false,false,false,false,false]
["Current & Potential"]
[]
[null,null,null,null,null,null,null,null,null,null,null,null,null,"<     Please Keep Scrolling     >",{"$f":"INDEX('LookupsC&P'!B:B,MATCH('Current & Potential'!A1,'LookupsC&P'!A:A,0))","v":"I need full support and someone to make all my food for me"}]
{"$rows_left_out":154}
{"sheet":"LookupsC&P","index":2,"n_rows":83,"n_cols":6,"rows_kept":83,"cut":false,"hidden":true,"merged":[]}
["A1-1","I need full support and someone to make all my food for me",1,"A2-1","I need full support and someone to make all my food for me",1]
["A1-2","I can make drinks or snacks myself but need constant support when making meals",2,"A2-2","I can make drinks or snacks myself but need constant support when making meals",2]
["A1-3","I can cook main meals with prompts and supervision or visual guidance ",3,"A2-3","I can cook main meals with prompts and supervision or visual guidance ",3]
["A1-4","I can cook all meals independently ",4,"A2-4","I can cook all meals independently ",4]
["B1-1","I need full support with all my eating and drinking, which may include pureeing my food or thickening fluids",1,"B2-1","I need full support with all my eating and drinking, which may include pureeing my food or thickening fluids",1]
["B1-2","I need constant supervision to make sure I am safe whilst eating and drinking",2,"B2-2","I need constant supervision to make sure I am safe whilst eating and drinking",2]
{"$rows_left_out":78}
{"sheet":"Support Form","index":3,"n_rows":28,"n_cols":13,"rows_kept":28,"cut":false,"hidden":true,"merged":[[24,1,25,1],[8,1,10,1],[11,1,13,1],[14,1,15,1],[17,1,18,1],[19,1,21,1],[22,1,23,1]]}
[]
[]
[null,"Full Name:",null,"Accommodation Type:"]
[null,"Date of Birth:",null,"SWIFT ID:"]
[null,"NHS ID:"]
[]
{"$rows_left_out":23}
{"sheet":"Goal Planning","index":4,"n_rows":24,"n_cols":42,"rows_kept":24,"cut":false,"hidden":false,"merged":[[1,40,3,40],[1,41,3,41],[0,37,0,40],[0,2,0,12],[0,14,0,24],[0,26,0,36],[1,39,3,39],[1,35,3,35],[1,2,2,33],[1,36,3,36],[1,37,3,37],[1,38,3,38]]}
[null,null,"<                         Please keep scrolling                         >",null,null,null,null,null,null,null,null,null,null,null,"<                         Please keep scrolling                         >",null,null,null,null,null,null,null,null,null,null,null,"<                         Please keep scrolling                         >",null,null,null,null,null,null,null,null,null,null,"<                         Please keep scrolling                         >",null,null,null,"¦          End          ¦"]
[null,null,"Please use this area to break down the steps to achieving their potential",null,null,null,null,null,null,null,null,null,null,null,null,null,null,null,null,null,null,null,null,null,null,null,null,null,null,null,null,null,null,null,null,"Review\n\nPlease choose which step you plan to have reached by 3 months","Review\n\nPlease choose which step you plan to have reached by 6 months","Review\n\nPlease choose which step you plan to have reached by 9 months","Review\n\nPlease choose which step you plan to have reached by 12 months","Weekly Support Hours Outcome\n\nIf you expect completing a step to reduce the weekly hours, please choose which step.","Commentary\n\nPlease enter any notes you wish to mention here.","Blockers\n\nPlease record here any thing outside of your control preventing or slowing progress"]
[]
[null,null,null,"Max Potential GOAL","More exact detail of Current status if required.","Step 1","Completed","Date Completed","Step 2","Completed","Date Completed","Step 3","Completed","Dare Completed","Step 4","Completed","Date Completed","Step 5","Completed","Date Completed","Step 6","Completed","Date Completed","Step 7","Completed","Date  Completed","Step 8","Completed","Date Completed","Step 9","Completed","Date Completed","Step 10","Completed","Date Completed"]
[null,null,"Cooking",{"$f":"'Support Form'!L9","v":"I need full support and someone to make all my food for me"}]
[null,null,"Eating and Drinking",{"$f":"'Support Form'!L10","v":"I need full support with all my eating and drinking, which may include pureeing my food or thickening fluids"}]
{"$rows_left_out":19}
{"sheet":"lookups","index":5,"n_rows":85,"n_cols":3,"rows_kept":85,"cut":false,"hidden":true,"merged":[]}
[]
["Cooking","I need full support and someone to make all my food for me",1]
["Cooking","I can make drinks or snacks myself but need constant support when making meals",2]
["Cooking","I can cook main meals with prompts and supervision or visual guidance ",3]
["Cooking","I can cook all meals independently ",4]
["Eating And Drinking","I need full support with all my eating and drinking, which may include pureeing my food or thickening fluids",1]
{"$rows_left_out":80}
{"sheet":"Options","index":6,"n_rows":31,"n_cols":30,"rows_kept":31,"cut":false,"hidden":true,"merged":[]}
["Support Type A","Ratio",null,"Support Type B",null,"Background",null,"Cooking","Eating And Drinking","Meal Planning","Maintaining Personal Hygiene","Managing Toilet Needs","Being Appropriately Clothed","Being Able To Make Use Of My Home Safely","Maintaining A Habitable Home Environment","Personal Relationships","Engaging in Work","Day Activities","Getting Into The Community","Transport","Personal Safety","Managing Money","Managing Letters & Correspondences","Communication","Sexual Health","Physical Wellbeing","Psychological Wellbeing","Health & Medication",null,"Owner"]
["No Support",0,null,"Support Hours - 1 support worker : 2 people",null,1,null,"I need full support and someone to make all my food for me","I need full support with all my eating and drinking, which may include pureeing my food or thickening fluids","I need full support and someone to plan my nutrition for me","I need full support in cleaning myself and maintain personal hygiene","I need full support with all my continence needs, including continence aids ","I need full support to get dressed and choose appropriate clothes ","I need full support to get around","I need full support to keep my home clean and safe","I need full support to see friends and family and different types of relationship","I am not ready to work","I need full support to spend my time during the day/ evening doing activities that I enjoy","I need full support to be able to get out into the community and to keep safe when out and about","I need full support when on public transport or in a mobility vehicle ","I need full support to keep myself safe","I need full support and someone to manage my money (as an Appointee/ LPA) and to help me claim benefits and attend appointments with the DWP","I need full support and someone to manage my correspondences",null,"I do not understand what I means to keep myself sexually safe and healthy","I need full support to manage my health needs, including medication and accessing health professionals when needed","I need full support to manage my psychological wellbeing",null,null,"Care Manager"]
["Support Hours - 1 support worker : 1 person",1,null,"Support Hours - 1 support worker : 3 people",null,2,null,"I can make drinks or snacks myself but need constant support when making meals","I need constant supervision to make sure I am safe whilst eating and drinking","I need support with menu planning & shopping but I can choose between options for different meals","I can wash and shower without physical support but need support/ supervision to make sure I am safe","I know when I need to go to the toilet but I need supervision to get to the toilet and use it","I need support to choose appropriate clothing and may need some assistance to put the clothing on","I need some support to ensure I am safe whilst moving around my home","I can do certain tasks but need  support to keep my home clean and safe","I need prompts to maintain my current relationships and support to create new relationships","I need support to find work","I need some support to plan activities & keep on task whilst there","I can get out into the community with shared support to prompt me to stay safe ","I am able to use public transport with support ","I am aware of some risk around me but need support to manage these consistently","I am able to manage my money day to day but need support to budget/manage bank accounts safely","I have an awareness of letters and correspondences but need support to read and respond to them",null,"I need information, advice and guidance to develop my understanding of how to keep myself sexually safe and healthy","I am able to take my medication with prompts and can recognise when I am feeling unwell but need support to make and attend medical appointments","I am able to recognise when my psychological wellbeing is deteriorating but need support to manage it",null,null,"Individual"]
["Support Hours - 2 support workers : 1 person",2,null,"Support Hours - 1 support worker : 4 people",null,3,null,"I can cook main meals with prompts and supervision or visual guidance ","I need occasional prompts and checks whilst eating and drinking or on a shared basis","I can plan my meals & do my shopping but need prompts to keep them healthy","I am able to wash and shower and maintain my personal hygiene independently, but need prompts so I don’t forget","I need prompts to go to the toilet but can do it on my own ","I can choose my own appropriate clothing and get dressed, with prompting","I am able to get around but need supervision to ensure my safety ","I can keep my home clean and safe when prompted","I have a few good relationships and see people when I want to but may need guidance on how to create new ones","I can work but need support to keep it","I can choose my own activities but need support to access them","I can access the community independently to places I am familiar with  but need support for less familiar places to make sure I stay safe","I am able to use public transport independently but may need initial support to access places that are unfamiliar ","I am aware of risks around me but need occasional prompts/reminders to make sure I stay safe ","I can manage a weekly budget and pay my bills but need support for any less common money matters including benefits applications etc.","I am able to read and respond to most letters but need support for any less common matters",null,"I understand and am able to keep myself sexually safe and healthy but need occasional support with one off activities such as managing appointments","I am able to manage my daily health needs independently.","I am able to manage my psychological wellbeing on an everyday basis but need support intermittently",null,null,"Family / Friends"]
["Support Hours - 3 support workers : 1 person",3,null,null,null,4,null,"I can cook all meals independently ","I can eat and drink all food safely on my own","I can plan my meals so they are healthy and lead to a balanced diet","I can maintain my personal hygiene independently ","I can manage my toileting needs independently ","I can independently get dressed and choose appropriate clothing","I can independently move/ get around without support","I can independently keep my home clean and safe ","I can maintain and create new relationships independently and have good social support around me","I can consistently and independently maintain my work role ","I can independently and safely fulfil my days ","I can access the community independently and safely ","I can independently and safely travel between locations ","I am aware of risks around me and can manage these independently ","I can manage all aspects of my finances","I can manage all aspects of my letters and correspondences",null,"I am independently able to keep myself sexually safe and healthy  ",null,"I am able to fully independently manage my psychological wellbeing and know who to contact if needed",null,null,"Provider"]
["Support Hours - 1 support worker : 2 people",0.5,null,null,null,5,null,null,null,null,null,null,null,null,null,null,null,null,null,null,null,null,null,null,null,null,null,null,null,"OT"]
{"$rows_left_out":26}
{"sheet":"Data Sheet (2)","index":7,"n_rows":26,"n_cols":27,"rows_kept":26,"cut":false,"hidden":true,"merged":[]}
["Max","Max",4,4,4,5,4,4,4,4,4,5,4,4,4,4,4,4,3,4,4,5]
["Goal","Goal",{"$f":"(INDEX('LookupsC&P'!$C:$C,MATCH('Current & Potential'!A2,'LookupsC&P'!$D:$D,0))/C1)*10","v":2.5},{"$f":"(INDEX('LookupsC&P'!$C:$C,MATCH('Current & Potential'!B2,'LookupsC&P'!$D:$D,0))/D1)*10","v":2.5},{"$f":"(INDEX('LookupsC&P'!$C:$C,MATCH('Current & Potential'!C2,'LookupsC&P'!$D:$D,0))/E1)*10","v":2.5},{"$f":"(INDEX('LookupsC&P'!$C:$C,MATCH('Current & Potential'!D2,'LookupsC&P'!$D:$D,0))/F1)*10","v":2},{"$f":"(INDEX('LookupsC&P'!$C:$C,MATCH('Current & Potential'!E2,'LookupsC&P'!$D:$D,0))/G1)*10","v":2.5},{"$f":"(INDEX('LookupsC&P'!$C:$C,MATCH('Current & Potential'!F2,'LookupsC&P'!$D:$D,0))/H1)*10","v":2.5},{"$f":"(INDEX('LookupsC&P'!$C:$C,MATCH('Current & Potential'!G2,'LookupsC&P'!$D:$D,0))/I1)*10","v":2.5},{"$f":"(INDEX('LookupsC&P'!$C:$C,MATCH('Current & Potential'!H2,'LookupsC&P'!$D:$D,0))/J1)*10","v":2.5},{"$f":"(INDEX('LookupsC&P'!$C:$C,MATCH('Current & Potential'!I2,'LookupsC&P'!$D:$D,0))/K1)*10","v":2.5},{"$f":"(INDEX('LookupsC&P'!$C:$C,MATCH('Current & Potential'!J2,'LookupsC&P'!$D:$D,0))/L1)*10","v":2},{"$f":"(INDEX('LookupsC&P'!$C:$C,MATCH('Current & Potential'!K2,'LookupsC&P'!$D:$D,0))/M1)*10","v":2.5},{"$f":"(INDEX('LookupsC&P'!$C:$C,MATCH('Current & Potential'!L2,'LookupsC&P'!$D:$D,0))/N1)*10","v":2.5},{"$f":"(INDEX('LookupsC&P'!$C:$C,MATCH('Current & Potential'!M2,'LookupsC&P'!$D:$D,0))/O1)*10","v":2.5},{"$f":"(INDEX('LookupsC&P'!$C:$C,MATCH('Current & Potential'!N2,'LookupsC&P'!$D:$D,0))/P1)*10","v":2.5},{"$f":"(INDEX('LookupsC&P'!$C:$C,MATCH('Current & Potential'!O2,'LookupsC&P'!$D:$D,0))/Q1)*10","v":2.5},{"$f":"(INDEX('LookupsC&P'!$C:$C,MATCH('Current & Potential'!P2,'LookupsC&P'!$D:$D,0))/R1)*10","v":2.5},{"$f":"(INDEX('LookupsC&P'!$C:$C,MATCH('Current & Potential'!Q2,'LookupsC&P'!$D:$D,0))/S1)*10","v":3.333333333333333},{"$f":"(INDEX('LookupsC&P'!$C:$C,MATCH('Current & Potential'!R2,'LookupsC&P'!$D:$D,0))/T1)*10","v":2.5},{"$f":"(INDEX('LookupsC&P'!$C:$C,MATCH('Current & Potential'!S2,'LookupsC&P'!$D:$D,0))/U1)*10","v":2.5},{"$f":"(INDEX('LookupsC&P'!$C:$C,MATCH('Current & Potential'!T2,'LookupsC&P'!$D:$D,0))/V1)*10","v":2},null,null,{"$f":"'Front Sheet'!B14","v":0},{"$f":"'Front Sheet'!C14","v":0},{"$f":"IFERROR(INDEX(Support[Ratio],MATCH('Data Sheet (2)'!Y2,Support[Support Type A],0))*'Data Sheet (2)'!Z2,0)","v":0}]
[null,"Basic",{"$f":"(C2/10)*C1","v":1},{"$f":"(D2/10)*D1","v":1},1,1,1,1,1,1,1,1,1,1,1,1,1,1,1,1,1,1,null,null,{"$f":"'Front Sheet'!B15","v":0},{"$f":"'Front Sheet'!C15","v":0},{"$f":"IFERROR(INDEX(Support[Ratio],MATCH('Data Sheet (2)'!Y3,Support[Support Type A],0))*'Data Sheet (2)'!Z3,0)","v":0}]
["Current",{"$f":"TODAY()","v":"2019-08-22"},{"$f":"(INDEX('LookupsC&P'!$C:$C,MATCH('Current & Potential'!A1,'LookupsC&P'!$A:$A,0))/C1)*10","v":2.5},{"$f":"(INDEX('LookupsC&P'!$C:$C,MATCH('Current & Potential'!B1,'LookupsC&P'!$A:$A,0))/D1)*10","v":2.5},{"$f":"(INDEX('LookupsC&P'!$C:$C,MATCH('Current & Potential'!C1,'LookupsC&P'!$A:$A,0))/E1)*10","v":2.5},{"$f":"(INDEX('LookupsC&P'!$C:$C,MATCH('Current & Potential'!D1,'LookupsC&P'!$A:$A,0))/F1)*10","v":2},{"$f":"(INDEX('LookupsC&P'!$C:$C,MATCH('Current & Potential'!E1,'LookupsC&P'!$A:$A,0))/G1)*10","v":2.5},{"$f":"(INDEX('LookupsC&P'!$C:$C,MATCH('Current & Potential'!F1,'LookupsC&P'!$A:$A,0))/H1)*10","v":2.5},{"$f":"(INDEX('LookupsC&P'!$C:$C,MATCH('Current & Potential'!G1,'LookupsC&P'!$A:$A,0))/I1)*10","v":2.5},{"$f":"(INDEX('LookupsC&P'!$C:$C,MATCH('Current & Potential'!H1,'LookupsC&P'!$A:$A,0))/J1)*10","v":2.5},{"$f":"(INDEX('LookupsC&P'!$C:$C,MATCH('Current & Potential'!I1,'LookupsC&P'!$A:$A,0))/K1)*10","v":2.5},{"$f":"(INDEX('LookupsC&P'!$C:$C,MATCH('Current & Potential'!J1,'LookupsC&P'!$A:$A,0))/L1)*10","v":2},{"$f":"(INDEX('LookupsC&P'!$C:$C,MATCH('Current & Potential'!K1,'LookupsC&P'!$A:$A,0))/M1)*10","v":2.5},{"$f":"(INDEX('LookupsC&P'!$C:$C,MATCH('Current & Potential'!L1,'LookupsC&P'!$A:$A,0))/N1)*10","v":2.5},{"$f":"(INDEX('LookupsC&P'!$C:$C,MATCH('Current & Potential'!M1,'LookupsC&P'!$A:$A,0))/O1)*10","v":2.5},{"$f":"(INDEX('LookupsC&P'!$C:$C,MATCH('Current & Potential'!N1,'LookupsC&P'!$A:$A,0))/P1)*10","v":2.5},{"$f":"(INDEX('LookupsC&P'!$C:$C,MATCH('Current & Potential'!O1,'LookupsC&P'!$A:$A,0))/Q1)*10","v":2.5},{"$f":"(INDEX('LookupsC&P'!$C:$C,MATCH('Current & Potential'!P1,'LookupsC&P'!$A:$A,0))/R1)*10","v":2.5},{"$f":"(INDEX('LookupsC&P'!$C:$C,MATCH('Current & Potential'!Q1,'LookupsC&P'!$A:$A,0))/S1)*10","v":3.333333333333333},{"$f":"(INDEX('LookupsC&P'!$C:$C,MATCH('Current & Potential'!R1,'LookupsC&P'!$A:$A,0))/T1)*10","v":2.5},{"$f":"(INDEX('LookupsC&P'!$C:$C,MATCH('Current & Potential'!S1,'LookupsC&P'!$A:$A,0))/U1)*10","v":2.5},{"$f":"(INDEX('LookupsC&P'!$C:$C,MATCH('Current & Potential'!T1,'LookupsC&P'!$A:$A,0))/V1)*10","v":2},null,null,{"$f":"'Front Sheet'!B16","v":0},{"$f":"'Front Sheet'!C16","v":0},{"$f":"IFERROR(INDEX(Support[Ratio],MATCH('Data Sheet (2)'!Y4,Support[Support Type A],0))*'Data Sheet (2)'!Z4,0)","v":0}]
[null,"Basic",{"$f":"(C4/10)*C1","v":1},{"$f":"(D4/10)*D1","v":1},1,1,1,1,1,1,1,1,1,1,1,1,1,1,1,1,1,1,{"$f":"(SUM(C5:V5)/SUM(C1:V1))*100","v":24.390243902439025},null,{"$f":"'Front Sheet'!B17","v":0},{"$f":"'Front Sheet'!C17","v":0},{"$f":"IFERROR(INDEX(Support[Ratio],MATCH('Data Sheet (2)'!Y5,Support[Support Type A],0))*'Data Sheet (2)'!Z5,0)","v":0}]
[null,"Date","Cooking","Eating and Drinking","Meal Planning","Washing and Keeping Clean","Toilet Needs","Dressing","Getting Around My Home","Safe and Clean Home","Personal Relationships","Day Activities","Work/ Volunteering","Getting into the Community","Transport","Personal Safety","Managing Money","Managing Correspondences","Physical Wellbeing","Psychological Wellbeing","Night Support","Support Setting",null,null,{"$f":"'Front Sheet'!#REF!","v":{"$error":"#REF!"}},{"$f":"'Front Sheet'!#REF!","v":{"$error":"#REF!"}},{"$f":"IFERROR(Z6/Y6,0)","v":0}]
{"$rows_left_out":21}
{"sheet":"Data Sheet","index":8,"n_rows":7,"n_cols":22,"rows_kept":7,"cut":false,"hidden":true,"merged":[[1,2,1,4]]}
[]
[null,"Name",{"$f":"'Support Form'!C3","v":0}]
[null,"Today's:"]
[null,{"$f":"TODAY()","v":"2019-08-22"},{"$f":"INDEX('LookupsC&P'!$C:$C,MATCH('Current & Potential'!A1,'LookupsC&P'!$A:$A,0))","v":1},{"$f":"INDEX('LookupsC&P'!$C:$C,MATCH('Current & Potential'!B1,'LookupsC&P'!$A:$A,0))","v":1},{"$f":"INDEX('LookupsC&P'!$C:$C,MATCH('Current & Potential'!C1,'LookupsC&P'!$A:$A,0))","v":1},{"$f":"INDEX('LookupsC&P'!$C:$C,MATCH('Current & Potential'!D1,'LookupsC&P'!$A:$A,0))","v":1},{"$f":"INDEX('LookupsC&P'!$C:$C,MATCH('Current & Potential'!E1,'LookupsC&P'!$A:$A,0))","v":1},{"$f":"INDEX('LookupsC&P'!$C:$C,MATCH('Current & Potential'!F1,'LookupsC&P'!$A:$A,0))","v":1},{"$f":"INDEX('LookupsC&P'!$C:$C,MATCH('Current & Potential'!G1,'LookupsC&P'!$A:$A,0))","v":1},{"$f":"INDEX('LookupsC&P'!$C:$C,MATCH('Current & Potential'!H1,'LookupsC&P'!$A:$A,0))","v":1},{"$f":"INDEX('LookupsC&P'!$C:$C,MATCH('Current & Potential'!I1,'LookupsC&P'!$A:$A,0))","v":1},{"$f":"INDEX('LookupsC&P'!$C:$C,MATCH('Current & Potential'!J1,'LookupsC&P'!$A:$A,0))","v":1},{"$f":"INDEX('LookupsC&P'!$C:$C,MATCH('Current & Potential'!K1,'LookupsC&P'!$A:$A,0))","v":1},{"$f":"INDEX('LookupsC&P'!$C:$C,MATCH('Current & Potential'!L1,'LookupsC&P'!$A:$A,0))","v":1},{"$f":"INDEX('LookupsC&P'!$C:$C,MATCH('Current & Potential'!M1,'LookupsC&P'!$A:$A,0))","v":1},{"$f":"INDEX('LookupsC&P'!$C:$C,MATCH('Current & Potential'!N1,'LookupsC&P'!$A:$A,0))","v":1},{"$f":"INDEX('LookupsC&P'!$C:$C,MATCH('Current & Potential'!O1,'LookupsC&P'!$A:$A,0))","v":1},{"$f":"INDEX('LookupsC&P'!$C:$C,MATCH('Current & Potential'!P1,'LookupsC&P'!$A:$A,0))","v":1},{"$f":"INDEX('LookupsC&P'!$C:$C,MATCH('Current & Potential'!Q1,'LookupsC&P'!$A:$A,0))","v":1},{"$f":"INDEX('LookupsC&P'!$C:$C,MATCH('Current & Potential'!R1,'LookupsC&P'!$A:$A,0))","v":1},{"$f":"INDEX('LookupsC&P'!$C:$C,MATCH('Current & Potential'!S1,'LookupsC&P'!$A:$A,0))","v":1},{"$f":"INDEX('LookupsC&P'!$C:$C,MATCH('Current & Potential'!T1,'LookupsC&P'!$A:$A,0))","v":1}]
[]
[null,"Date","Cooking","Eating and Drinking","Meal Planning","Washing and Keeping Clean","Toilet","Dressing","Getting Around My Home","Safe and Clean Home","Personal Relationships","Day Activities","Work/ Volunteering","Getting into the Community","Transport","Personal Safety","Managing Money","Managing Correspondences","Physical Wellbeing","Psychological Wellbeing","Night Support","Support Setting"]
{"$rows_left_out":2}
{"sheet":"Charts","index":9,"n_rows":28,"n_cols":1,"rows_kept":28,"cut":false,"hidden":true,"merged":[[1,0,1,27],[27,0,27,27]]}
[]
["Progress"]
[]
[]
[]
[]
{"$rows_left_out":22}